[Dune] Dune on cygwin

Ganesh Diwan gcdiwan83 at gmail.com
Wed Feb 4 20:21:24 CET 2015


I don't think it is able to perform this test successfully, here is the
output:

Thanks
Ganesh

/usr/lib/gcc/x86_64-pc-cygwin/4.9.2/../../../../lib/libcygwin.a(_cygwin_crt0_common.o):_cygwin_crt0_common.cc:(.data+0x0):
undefined reference to `operator new(unsigned long)'
collect2: error: ld returned 1 exit status
makefile:1285: recipe for target 'arraylisttest.exe' failed
make[4]: *** [arraylisttest.exe] Error 1
make[4]: Leaving directory
'C:/LocalApp/local/dune2.3.1/dune-common-2.3.1/dune/common/test'
makefile:2721: recipe for target 'check-am' failed
make[3]: *** [check-am] Error 2
make[3]: Leaving directory
'C:/LocalApp/local/dune2.3.1/dune-common-2.3.1/dune/common/test'
makefile:699: recipe for target 'check-recursive' failed
make[2]: *** [check-recursive] Error 1
make[2]: Leaving directory
'C:/LocalApp/local/dune2.3.1/dune-common-2.3.1/dune/common'
makefile:468: recipe for target 'check-recursive' failed
make[1]: *** [check-recursive] Error 1
make[1]: Leaving directory
'C:/LocalApp/local/dune2.3.1/dune-common-2.3.1/dune'
makefile:630: recipe for target 'check-recursive' failed
make: *** [check-recursive] Error 1


On Wed, Feb 4, 2015 at 7:00 PM, Oliver Sander <sander at igpm.rwth-aachen.de>
wrote:

> Am 04.02.2015 um 13:11 schrieb Ganesh Diwan:
> > Sorry, got a bounce from mailing list due to long message body. Attached!
> >
>
> Hmm, if you enter the dune-common directory and type
>
> make check
>
> there, does it successfully build and run the unit tests?
>
> --
> Oliver
>
>
>
-------------- next part --------------
An HTML attachment was scrubbed...
URL: <https://lists.dune-project.org/pipermail/dune/attachments/20150204/bb125b10/attachment.html>


More information about the Dune mailing list