[Dune] Dune Trunk Build Problem

Oliver Sander sander at mi.fu-berlin.de
Thu Sep 2 16:20:22 CEST 2010


Hi Arya!
Thanks for pointing this out.  Should be fixed now.
--
Oliver

Am 2010-09-01 15:56, schrieb arya fallahi:
> Dear Dune, I just updated the dune version I have on my PC and now I have problems in building the trunk version of Dune.
> The versions, the platform name, compiler  and the error are show below.
>
> Thanks for having a look!
>
>
> Greetings, Arya
>
> 1. The dune versions are as follows:
>
> Path: dune-common
> URL: https://svn.dune-project.org/svn/dune-common/trunk
> Repository Root: https://svn.dune-project.org/svn/dune-common
> Repository UUID: 419231ca-4411-0410-aba2-fc6cf8c4f609
> Revision: 6114
> Node Kind: directory
> Schedule: normal
> Last Changed Author: christi
> Last Changed Rev: 6114
> Last Changed Date: 2010-09-01 15:24:41 +0200 (Wed, 01 Sep 2010)
>
> Path: dune-istl
> URL: https://svn.dune-project.org/svn/dune-istl/trunk
> Repository Root: https://svn.dune-project.org/svn/dune-istl
> Repository UUID: 8c7282f0-4411-0410-8e4f-cdd3e049afb8
> Revision: 1281
> Node Kind: directory
> Schedule: normal
> Last Changed Author: mblatt
> Last Changed Rev: 1281
> Last Changed Date: 2010-08-27 11:33:32 +0200 (Fri, 27 Aug 2010)
>
> Path: dune-grid-howto
> URL: https://svn.dune-project.org/svn/dune-grid-howto/trunk
> Repository Root: https://svn.dune-project.org/svn/dune-grid-howto
> Repository UUID: 971b7fa1-7d12-0410-b1b7-9c127676b1f7
> Revision: 326
> Node Kind: directory
> Schedule: normal
> Last Changed Author: sander
> Last Changed Rev: 326
> Last Changed Date: 2010-08-31 12:12:29 +0200 (Tue, 31 Aug 2010)
>
> Path: dune-grid
> URL: https://svn.dune-project.org/svn/dune-grid/trunk
> Repository Root: https://svn.dune-project.org/svn/dune-grid
> Repository UUID: f82f27de-4411-0410-b156-930a902cda50
> Revision: 6924
> Node Kind: directory
> Schedule: normal
> Last Changed Author: mnolte
> Last Changed Rev: 6924
> Last Changed Date: 2010-09-01 15:27:17 +0200 (Wed, 01 Sep 2010)
>
> 2. Platform:
> Darwin odin-129129158074.psi.ch 10.4.0 Darwin Kernel Version 10.4.0: Fri Apr 23 18:28:53 PDT 2010; root:xnu-1504.7.4~1/RELEASE_I386 i386
>
> 3. compiler version:
> i686-apple-darwin10-g++-4.2.1 (GCC) 4.2.1 (Apple Inc. build 5659)
> Copyright (C) 2007 Free Software Foundation, Inc.
> This is free software; see the source for copying conditions.  There is NO
> warranty; not even for MERCHANTABILITY or FITNESS FOR A PARTICULAR PURPOSE.
>
> 4. The error message is as follows:
>
> In file included from /Users/fallahi/svnwork/dune-trunk/dune-grid/dune/grid/uggrid.hh:39,
>                   from othergrids.cc:8:
> /Users/fallahi/svnwork/dune-trunk/dune-grid/dune/grid/uggrid/ugincludes.hh:13:16: error: gm.h: No such file or directory
> /Users/fallahi/svnwork/dune-trunk/dune-grid/dune/grid/uggrid/ugincludes.hh:17:24: error: std_domain.h: No such file or directory
> /Users/fallahi/svnwork/dune-trunk/dune-grid/dune/grid/uggrid/ugincludes.hh:19:20: error: initug.h: No such file or directory
> /Users/fallahi/svnwork/dune-trunk/dune-grid/dune/grid/uggrid/ugincludes.hh:20:22: error: commands.h: No such file or directory
> /Users/fallahi/svnwork/dune-trunk/dune-grid/dune/grid/uggrid/ugincludes.hh:21:21: error: formats.h: No such file or directory
> /Users/fallahi/svnwork/dune-trunk/dune-grid/dune/grid/uggrid/ugincludes.hh:22:22: error: elements.h: No such file or directory
> /Users/fallahi/svnwork/dune-trunk/dune-grid/dune/grid/uggrid/ugincludes.hh:23:20: error: shapes.h: No such file or directory
> /Users/fallahi/svnwork/dune-trunk/dune-grid/dune/grid/uggrid/ugincludes.hh:24:21: error: algebra.h: No such file or directory
> /Users/fallahi/svnwork/dune-trunk/dune-grid/dune/grid/uggrid/ugincludes.hh:25:20: error: refine.h: No such file or directory
> /Users/fallahi/svnwork/dune-trunk/dune-grid/dune/grid/uggrid/ugincludes.hh:26:17: error: ugm.h: No such file or directory
> /Users/fallahi/svnwork/dune-trunk/dune-grid/dune/grid/uggrid/ugincludes.hh:27:16: error: rm.h: No such file or directory
> In file included from /Users/fallahi/svnwork/dune-trunk/dune-grid/dune/grid/uggrid.hh:44,
>                   from othergrids.cc:8:
> /Users/fallahi/svnwork/dune-trunk/dune-grid/dune/grid/uggrid/ugwrapper.hh:39: error: ‘UG’ has not been declared
> /Users/fallahi/svnwork/dune-trunk/dune-grid/dune/grid/uggrid/ugwrapper.hh:40: error: ‘UG’ has not been declared
> /Users/fallahi/svnwork/dune-trunk/dune-grid/dune/grid/uggrid/ugwrapper.hh:41: error: ‘UG’ has not been declared
> /Users/fallahi/svnwork/dune-trunk/dune-grid/dune/grid/uggrid/ugwrapper.hh:43: error: ‘UG’ has not been declared
> /Users/fallahi/svnwork/dune-trunk/dune-grid/dune/grid/uggrid/ugwrapper.hh:44: error: ‘UG’ has not been declared
> /Users/fallahi/svnwork/dune-trunk/dune-grid/dune/grid/uggrid/ugwrapper.hh:45: error: ‘UG’ has not been declared
> /Users/fallahi/svnwork/dune-trunk/dune-grid/dune/grid/uggrid/ugwrapper.hh:49: error: ‘UG’ has not been declared
> /Users/fallahi/svnwork/dune-trunk/dune-grid/dune/grid/uggrid/ugwrapper.hh:49: error: ISO C++ forbids declaration of ‘RefinementRule’ with no type
> /Users/fallahi/svnwork/dune-trunk/dune-grid/dune/grid/uggrid/ugwrapper.hh:49: error: typedef name may not be a nested-name-specifier
> /Users/fallahi/svnwork/dune-trunk/dune-grid/dune/grid/uggrid/ugwrapper.hh:49: error: expected ‘;’ before ‘RefinementRule’
> /Users/fallahi/svnwork/dune-trunk/dune-grid/dune/grid/uggrid/ugwrapper.hh:51: error: ‘UG’ has not been declared
> /Users/fallahi/svnwork/dune-trunk/dune-grid/dune/grid/uggrid/ugwrapper.hh:51: error: ISO C++ forbids declaration of ‘CoeffProcPtr’ with no type
> /Users/fallahi/svnwork/dune-trunk/dune-grid/dune/grid/uggrid/ugwrapper.hh:51: error: typedef name may not be a nested-name-specifier
> /Users/fallahi/svnwork/dune-trunk/dune-grid/dune/grid/uggrid/ugwrapper.hh:51: error: expected ‘;’ before ‘CoeffProcPtr’
> /Users/fallahi/svnwork/dune-trunk/dune-grid/dune/grid/uggrid/ugwrapper.hh:53: error: ‘UG’ has not been declared
> /Users/fallahi/svnwork/dune-trunk/dune-grid/dune/grid/uggrid/ugwrapper.hh:53: error: ISO C++ forbids declaration of ‘UserProcPtr’ with no type
> /Users/fallahi/svnwork/dune-trunk/dune-grid/dune/grid/uggrid/ugwrapper.hh:53: error: typedef name may not be a nested-name-specifier
> /Users/fallahi/svnwork/dune-trunk/dune-grid/dune/grid/uggrid/ugwrapper.hh:53: error: expected ‘;’ before ‘UserProcPtr’
> /Users/fallahi/svnwork/dune-trunk/dune-grid/dune/grid/uggrid/ugwrapper.hh:56: error: ‘UG’ has not been declared
> /Users/fallahi/svnwork/dune-trunk/dune-grid/dune/grid/uggrid/ugwrapper.hh:56: error: ISO C++ forbids declaration of ‘BndSegFuncPtr’ with no type
> /Users/fallahi/svnwork/dune-trunk/dune-grid/dune/grid/uggrid/ugwrapper.hh:56: error: typedef name may not be a nested-name-specifier
> /Users/fallahi/svnwork/dune-trunk/dune-grid/dune/grid/uggrid/ugwrapper.hh:56: error: expected ‘;’ before ‘BndSegFuncPtr’
> /Users/fallahi/svnwork/dune-trunk/dune-grid/dune/grid/uggrid/ugwrapper.hh:60: error: ‘UG’ has not been declared
> /Users/fallahi/svnwork/dune-trunk/dune-grid/dune/grid/uggrid/ugwrapper.hh:60: error: ISO C++ forbids declaration of ‘vector’ with no type
> /Users/fallahi/svnwork/dune-trunk/dune-grid/dune/grid/uggrid/ugwrapper.hh:60: error: typedef name may not be a nested-name-specifier
> /Users/fallahi/svnwork/dune-trunk/dune-grid/dune/grid/uggrid/ugwrapper.hh:60: error: expected ‘;’ before ‘Vector’
> /Users/fallahi/svnwork/dune-trunk/dune-grid/dune/grid/uggrid/ugwrapper.hh:63: error: ‘UG’ has not been declared
> /Users/fallahi/svnwork/dune-trunk/dune-grid/dune/grid/uggrid/ugwrapper.hh:63: error: ISO C++ forbids declaration of ‘multigrid’ with no type
> /Users/fallahi/svnwork/dune-trunk/dune-grid/dune/grid/uggrid/ugwrapper.hh:63: error: typedef name may not be a nested-name-specifier
> /Users/fallahi/svnwork/dune-trunk/dune-grid/dune/grid/uggrid/ugwrapper.hh:63: error: expected ‘;’ before ‘MultiGrid’
> /Users/fallahi/svnwork/dune-trunk/dune-grid/dune/grid/uggrid/ugwrapper.hh:66: error: ‘UG’ has not been declared
> /Users/fallahi/svnwork/dune-trunk/dune-grid/dune/grid/uggrid/ugwrapper.hh:66: error: ISO C++ forbids declaration of ‘grid’ with no type
> /Users/fallahi/svnwork/dune-trunk/dune-grid/dune/grid/uggrid/ugwrapper.hh:66: error: typedef name may not be a nested-name-specifier
> /Users/fallahi/svnwork/dune-trunk/dune-grid/dune/grid/uggrid/ugwrapper.hh:66: error: expected ‘;’ before ‘Grid’
> /Users/fallahi/svnwork/dune-trunk/dune-grid/dune/grid/uggrid/ugwrapper.hh:68: error: ‘UG’ has not been declared
> /Users/fallahi/svnwork/dune-trunk/dune-grid/dune/grid/uggrid/ugwrapper.hh:68: error: ISO C++ forbids declaration of ‘edge’ with no type
> /Users/fallahi/svnwork/dune-trunk/dune-grid/dune/grid/uggrid/ugwrapper.hh:68: error: typedef name may not be a nested-name-specifier
> /Users/fallahi/svnwork/dune-trunk/dune-grid/dune/grid/uggrid/ugwrapper.hh:68: error: expected ‘;’ before ‘Edge’
> /Users/fallahi/svnwork/dune-trunk/dune-grid/dune/grid/uggrid/ugwrapper.hh:70: error: ‘UG’ has not been declared
> /Users/fallahi/svnwork/dune-trunk/dune-grid/dune/grid/uggrid/ugwrapper.hh:70: error: ISO C++ forbids declaration of ‘node’ with no type
> /Users/fallahi/svnwork/dune-trunk/dune-grid/dune/grid/uggrid/ugwrapper.hh:70: error: typedef name may not be a nested-name-specifier
> /Users/fallahi/svnwork/dune-trunk/dune-grid/dune/grid/uggrid/ugwrapper.hh:70: error: expected ‘;’ before ‘Node’
> /Users/fallahi/svnwork/dune-trunk/dune-grid/dune/grid/uggrid/ugwrapper.hh:72: error: ‘UG’ has not been declared
> /Users/fallahi/svnwork/dune-trunk/dune-grid/dune/grid/uggrid/ugwrapper.hh:72: error: ISO C++ forbids declaration of ‘element’ with no type
> /Users/fallahi/svnwork/dune-trunk/dune-grid/dune/grid/uggrid/ugwrapper.hh:72: error: typedef name may not be a nested-name-specifier
> /Users/fallahi/svnwork/dune-trunk/dune-grid/dune/grid/uggrid/ugwrapper.hh:72: error: expected ‘;’ before ‘Element’
> /Users/fallahi/svnwork/dune-trunk/dune-grid/dune/grid/uggrid/ugwrapper.hh:74: error: ‘UG’ has not been declared
> /Users/fallahi/svnwork/dune-trunk/dune-grid/dune/grid/uggrid/ugwrapper.hh:74: error: ISO C++ forbids declaration of ‘vertex’ with no type
> /Users/fallahi/svnwork/dune-trunk/dune-grid/dune/grid/uggrid/ugwrapper.hh:74: error: typedef name may not be a nested-name-specifier
> /Users/fallahi/svnwork/dune-trunk/dune-grid/dune/grid/uggrid/ugwrapper.hh:74: error: expected ‘;’ before ‘Vertex’
> /Users/fallahi/svnwork/dune-trunk/dune-grid/dune/grid/uggrid/ugwrapper.hh:77: error: ‘UG’ has not been declared
> /Users/fallahi/svnwork/dune-trunk/dune-grid/dune/grid/uggrid/ugwrapper.hh:77: error: ISO C++ forbids declaration of ‘BNDP’ with no type
> /Users/fallahi/svnwork/dune-trunk/dune-grid/dune/grid/uggrid/ugwrapper.hh:77: error: typedef name may not be a nested-name-specifier
> /Users/fallahi/svnwork/dune-trunk/dune-grid/dune/grid/uggrid/ugwrapper.hh:77: error: expected ‘;’ before ‘BNDP’
> /Users/fallahi/svnwork/dune-trunk/dune-grid/dune/grid/uggrid/ugwrapper.hh:235: error: ‘UG’ has not been declared
> /Users/fallahi/svnwork/dune-trunk/dune-grid/dune/grid/uggrid/ugwrapper.hh:237: error: ‘UG’ has not been declared
> /Users/fallahi/svnwork/dune-trunk/dune-grid/dune/grid/uggrid/ugwrapper.hh:239: error: ‘UG’ has not been declared
> /Users/fallahi/svnwork/dune-trunk/dune-grid/dune/grid/uggrid/ugwrapper.hh:241: error: ‘UG’ has not been declared
> /Users/fallahi/svnwork/dune-trunk/dune-grid/dune/grid/uggrid/ugwrapper.hh:243: error: ‘UG’ has not been declared
> /Users/fallahi/svnwork/dune-trunk/dune-grid/dune/grid/uggrid/ugwrapper.hh:246: error: ‘UG’ has not been declared
> /Users/fallahi/svnwork/dune-trunk/dune-grid/dune/grid/uggrid/ugwrapper.hh:247: error: ‘UG’ has not been declared
> /Users/fallahi/svnwork/dune-trunk/dune-grid/dune/grid/uggrid/ugwrapper.hh:248: error: ‘UG’ has not been declared
> /Users/fallahi/svnwork/dune-trunk/dune-grid/dune/grid/uggrid/ugwrapper.hh:249: error: ‘UG’ has not been declared
> /Users/fallahi/svnwork/dune-trunk/dune-grid/dune/grid/uggrid/ugwrapper.hh:252: error: ‘UG’ has not been declared
> /Users/fallahi/svnwork/dune-trunk/dune-grid/dune/grid/uggrid/ugwrapper.hh:253: error: ‘UG’ has not been declared
> /Users/fallahi/svnwork/dune-trunk/dune-grid/dune/grid/uggrid/ugwrapper.hh:254: error: ‘UG’ has not been declared
> /Users/fallahi/svnwork/dune-trunk/dune-grid/dune/grid/uggrid/ugwrapper.hh:256: error: ‘UG’ has not been declared
> /Users/fallahi/svnwork/dune-trunk/dune-grid/dune/grid/uggrid/ugwrapper.hh:258: error: ‘UG’ has not been declared
> /Users/fallahi/svnwork/dune-trunk/dune-grid/dune/grid/uggrid/ugwrapper.hh:260: error: ‘UG’ has not been declared
> /Users/fallahi/svnwork/dune-trunk/dune-grid/dune/grid/uggrid/ugwrapper.hh:265: error: ISO C++ forbids declaration of ‘Node’ with no type
> /Users/fallahi/svnwork/dune-trunk/dune-grid/dune/grid/uggrid/ugwrapper.hh:265: error: extra qualification ‘Dune::UG_NS<2>::’ on member ‘Node’
> /Users/fallahi/svnwork/dune-trunk/dune-grid/dune/grid/uggrid/ugwrapper.hh:265: error: expected ‘;’ before ‘*’ token
> /Users/fallahi/svnwork/dune-trunk/dune-grid/dune/grid/uggrid/ugwrapper.hh:279: error: expected `;' before ‘static’
> /Users/fallahi/svnwork/dune-trunk/dune-grid/dune/grid/uggrid/ugwrapper.hh:279: error: ISO C++ forbids declaration of ‘Node’ with no type
> /Users/fallahi/svnwork/dune-trunk/dune-grid/dune/grid/uggrid/ugwrapper.hh:279: error: extra qualification ‘Dune::UG_NS<2>::’ on member ‘Node’
> /Users/fallahi/svnwork/dune-trunk/dune-grid/dune/grid/uggrid/ugwrapper.hh:279: error: expected ‘;’ before ‘*’ token
> /Users/fallahi/svnwork/dune-trunk/dune-grid/dune/grid/uggrid/ugwrapper.hh:293: error: expected `;' before ‘static’
> /Users/fallahi/svnwork/dune-trunk/dune-grid/dune/grid/uggrid/ugwrapper.hh:293: error: ISO C++ forbids declaration of ‘Element’ with no type
> /Users/fallahi/svnwork/dune-trunk/dune-grid/dune/grid/uggrid/ugwrapper.hh:293: error: extra qualification ‘Dune::UG_NS<2>::’ on member ‘Element’
> /Users/fallahi/svnwork/dune-trunk/dune-grid/dune/grid/uggrid/ugwrapper.hh:293: error: expected ‘;’ before ‘*’ token
> /Users/fallahi/svnwork/dune-trunk/dune-grid/dune/grid/uggrid/ugwrapper.hh:307: error: expected `;' before ‘static’
> /Users/fallahi/svnwork/dune-trunk/dune-grid/dune/grid/uggrid/ugwrapper.hh:307: error: ISO C++ forbids declaration of ‘Element’ with no type
> /Users/fallahi/svnwork/dune-trunk/dune-grid/dune/grid/uggrid/ugwrapper.hh:307: error: extra qualification ‘Dune::UG_NS<2>::’ on member ‘Element’
> /Users/fallahi/svnwork/dune-trunk/dune-grid/dune/grid/uggrid/ugwrapper.hh:307: error: expected ‘;’ before ‘*’ token
> /Users/fallahi/svnwork/dune-trunk/dune-grid/dune/grid/uggrid/ugwrapper.hh:318: error: expected `;' before ‘static’
> /Users/fallahi/svnwork/dune-trunk/dune-grid/dune/grid/uggrid/ugwrapper.hh:318: error: expected unqualified-id before ‘*’ token
> /Users/fallahi/svnwork/dune-trunk/dune-grid/dune/grid/uggrid/ugwrapper.hh:318: error: expected ‘,’ or ‘...’ before ‘*’ token
> /Users/fallahi/svnwork/dune-trunk/dune-grid/dune/grid/uggrid/ugwrapper.hh:332: error: expected unqualified-id before ‘*’ token
> /Users/fallahi/svnwork/dune-trunk/dune-grid/dune/grid/uggrid/ugwrapper.hh:332: error: expected ‘,’ or ‘...’ before ‘*’ token
> /Users/fallahi/svnwork/dune-trunk/dune-grid/dune/grid/uggrid/ugwrapper.hh:332: error: ‘static void Dune::UG_NS<2>::Corner_Coordinates()’ cannot be overloaded
> /Users/fallahi/svnwork/dune-trunk/dune-grid/dune/grid/uggrid/ugwrapper.hh:318: error: with ‘static void Dune::UG_NS<2>::Corner_Coordinates()’
> /Users/fallahi/svnwork/dune-trunk/dune-grid/dune/grid/uggrid/ugwrapper.hh:354: error: expected unqualified-id before ‘*’ token
> /Users/fallahi/svnwork/dune-trunk/dune-grid/dune/grid/uggrid/ugwrapper.hh:354: error: expected ‘,’ or ‘...’ before ‘*’ token
> /Users/fallahi/svnwork/dune-trunk/dune-grid/dune/grid/uggrid/ugwrapper.hh:359: error: expected unqualified-id before ‘*’ token
> /Users/fallahi/svnwork/dune-trunk/dune-grid/dune/grid/uggrid/ugwrapper.hh:359: error: expected ‘,’ or ‘...’ before ‘*’ token
> /Users/fallahi/svnwork/dune-trunk/dune-grid/dune/grid/uggrid/ugwrapper.hh:359: error: ‘static int Dune::UG_NS<2>::myLevel()’ cannot be overloaded
> /Users/fallahi/svnwork/dune-trunk/dune-grid/dune/grid/uggrid/ugwrapper.hh:354: error: with ‘static int Dune::UG_NS<2>::myLevel()’
> /Users/fallahi/svnwork/dune-trunk/dune-grid/dune/grid/uggrid/ugwrapper.hh:365: error: expected unqualified-id before ‘*’ token
> /Users/fallahi/svnwork/dune-trunk/dune-grid/dune/grid/uggrid/ugwrapper.hh:365: error: expected ‘,’ or ‘...’ before ‘*’ token
> /Users/fallahi/svnwork/dune-trunk/dune-grid/dune/grid/uggrid/ugwrapper.hh:375: error: expected unqualified-id before ‘*’ token
> /Users/fallahi/svnwork/dune-trunk/dune-grid/dune/grid/uggrid/ugwrapper.hh:375: error: expected ‘,’ or ‘...’ before ‘*’ token
> /Users/fallahi/svnwork/dune-trunk/dune-grid/dune/grid/uggrid/ugwrapper.hh:383: error: expected unqualified-id before ‘*’ token
> /Users/fallahi/svnwork/dune-trunk/dune-grid/dune/grid/uggrid/ugwrapper.hh:383: error: expected ‘,’ or ‘...’ before ‘*’ token
> /Users/fallahi/svnwork/dune-trunk/dune-grid/dune/grid/uggrid/ugwrapper.hh:390: error: ISO C++ forbids declaration of ‘Element’ with no type
> /Users/fallahi/svnwork/dune-trunk/dune-grid/dune/grid/uggrid/ugwrapper.hh:390: error: extra qualification ‘Dune::UG_NS<2>::’ on member ‘Element’
> /Users/fallahi/svnwork/dune-trunk/dune-grid/dune/grid/uggrid/ugwrapper.hh:390: error: expected ‘;’ before ‘*’ token
> /Users/fallahi/svnwork/dune-trunk/dune-grid/dune/grid/uggrid/ugwrapper.hh:397: error: expected `;' before ‘static’
> /Users/fallahi/svnwork/dune-trunk/dune-grid/dune/grid/uggrid/ugwrapper.hh:397: error: expected unqualified-id before ‘*’ token
> /Users/fallahi/svnwork/dune-trunk/dune-grid/dune/grid/uggrid/ugwrapper.hh:397: error: expected ‘,’ or ‘...’ before ‘*’ token
> /Users/fallahi/svnwork/dune-trunk/dune-grid/dune/grid/uggrid/ugwrapper.hh:408: error: expected unqualified-id before ‘*’ token
> /Users/fallahi/svnwork/dune-trunk/dune-grid/dune/grid/uggrid/ugwrapper.hh:408: error: expected ‘,’ or ‘...’ before ‘*’ token
> /Users/fallahi/svnwork/dune-trunk/dune-grid/dune/grid/uggrid/ugwrapper.hh:418: error: expected unqualified-id before ‘*’ token
> /Users/fallahi/svnwork/dune-trunk/dune-grid/dune/grid/uggrid/ugwrapper.hh:418: error: expected ‘,’ or ‘...’ before ‘*’ token
> /Users/fallahi/svnwork/dune-trunk/dune-grid/dune/grid/uggrid/ugwrapper.hh:426: error: expected unqualified-id before ‘*’ token
> /Users/fallahi/svnwork/dune-trunk/dune-grid/dune/grid/uggrid/ugwrapper.hh:426: error: expected ‘,’ or ‘...’ before ‘*’ token
> /Users/fallahi/svnwork/dune-trunk/dune-grid/dune/grid/uggrid/ugwrapper.hh:433: error: expected unqualified-id before ‘*’ token
> /Users/fallahi/svnwork/dune-trunk/dune-grid/dune/grid/uggrid/ugwrapper.hh:433: error: expected ‘,’ or ‘...’ before ‘*’ token
> /Users/fallahi/svnwork/dune-trunk/dune-grid/dune/grid/uggrid/ugwrapper.hh:441: error: expected unqualified-id before ‘*’ token
> /Users/fallahi/svnwork/dune-trunk/dune-grid/dune/grid/uggrid/ugwrapper.hh:441: error: expected ‘,’ or ‘...’ before ‘*’ token
> /Users/fallahi/svnwork/dune-trunk/dune-grid/dune/grid/uggrid/ugwrapper.hh:441: error: ‘static int Dune::UG_NS<2>::Corners_Of_Elem()’ cannot be overloaded
> /Users/fallahi/svnwork/dune-trunk/dune-grid/dune/grid/uggrid/ugwrapper.hh:433: error: with ‘static int Dune::UG_NS<2>::Corners_Of_Elem()’
> /Users/fallahi/svnwork/dune-trunk/dune-grid/dune/grid/uggrid/ugwrapper.hh:446: error: expected unqualified-id before ‘*’ token
> /Users/fallahi/svnwork/dune-trunk/dune-grid/dune/grid/uggrid/ugwrapper.hh:446: error: expected ‘,’ or ‘...’ before ‘*’ token
> /Users/fallahi/svnwork/dune-trunk/dune-grid/dune/grid/uggrid/ugwrapper.hh:453: error: expected unqualified-id before ‘*’ token
> /Users/fallahi/svnwork/dune-trunk/dune-grid/dune/grid/uggrid/ugwrapper.hh:453: error: expected ‘,’ or ‘...’ before ‘*’ token
> /Users/fallahi/svnwork/dune-trunk/dune-grid/dune/grid/uggrid/ugwrapper.hh:460: error: expected unqualified-id before ‘*’ token
> /Users/fallahi/svnwork/dune-trunk/dune-grid/dune/grid/uggrid/ugwrapper.hh:460: error: expected ‘,’ or ‘...’ before ‘*’ token
> /Users/fallahi/svnwork/dune-trunk/dune-grid/dune/grid/uggrid/ugwrapper.hh:467: error: expected ‘,’ or ‘...’ before ‘::’ token
> /Users/fallahi/svnwork/dune-trunk/dune-grid/dune/grid/uggrid/ugwrapper.hh:467: error: ISO C++ forbids declaration of ‘UG’ with no type
> /Users/fallahi/svnwork/dune-trunk/dune-grid/dune/grid/uggrid/ugwrapper.hh:471: error: expected ‘,’ or ‘...’ before ‘::’ token
> /Users/fallahi/svnwork/dune-trunk/dune-grid/dune/grid/uggrid/ugwrapper.hh:471: error: ISO C++ forbids declaration of ‘UG’ with no type
> /Users/fallahi/svnwork/dune-trunk/dune-grid/dune/grid/uggrid/ugwrapper.hh:476: error: expected ‘,’ or ‘...’ before ‘::’ token
> /Users/fallahi/svnwork/dune-trunk/dune-grid/dune/grid/uggrid/ugwrapper.hh:476: error: ISO C++ forbids declaration of ‘UG’ with no type
> /Users/fallahi/svnwork/dune-trunk/dune-grid/dune/grid/uggrid/ugwrapper.hh:481: error: expected unqualified-id before ‘*’ token
> /Users/fallahi/svnwork/dune-trunk/dune-grid/dune/grid/uggrid/ugwrapper.hh:481: error: expected ‘,’ or ‘...’ before ‘*’ token
> /Users/fallahi/svnwork/dune-trunk/dune-grid/dune/grid/uggrid/ugwrapper.hh:485: error: ‘UG’ has not been declared
> /Users/fallahi/svnwork/dune-trunk/dune-grid/dune/grid/uggrid/ugwrapper.hh:485: error: expected ‘,’ or ‘...’ before ‘*’ token
> /Users/fallahi/svnwork/dune-trunk/dune-grid/dune/grid/uggrid/ugwrapper.hh:490: error: expected unqualified-id before ‘*’ token
> /Users/fallahi/svnwork/dune-trunk/dune-grid/dune/grid/uggrid/ugwrapper.hh:490: error: expected ‘,’ or ‘...’ before ‘*’ token
> /Users/fallahi/svnwork/dune-trunk/dune-grid/dune/grid/uggrid/ugwrapper.hh:496: error: expected unqualified-id before ‘*’ token
> /Users/fallahi/svnwork/dune-trunk/dune-grid/dune/grid/uggrid/ugwrapper.hh:496: error: expected ‘,’ or ‘...’ before ‘*’ token
> /Users/fallahi/svnwork/dune-trunk/dune-grid/dune/grid/uggrid/ugwrapper.hh:496: error: ‘static unsigned int Dune::UG_NS<2>::Tag()’ cannot be overloaded
> /Users/fallahi/svnwork/dune-trunk/dune-grid/dune/grid/uggrid/ugwrapper.hh:490: error: with ‘static unsigned int Dune::UG_NS<2>::Tag()’
> /Users/fallahi/svnwork/dune-trunk/dune-grid/dune/grid/uggrid/ugwrapper.hh:503: error: expected unqualified-id before ‘*’ token
> /Users/fallahi/svnwork/dune-trunk/dune-grid/dune/grid/uggrid/ugwrapper.hh:503: error: expected ‘,’ or ‘...’ before ‘*’ token
> /Users/fallahi/svnwork/dune-trunk/dune-grid/dune/grid/uggrid/ugwrapper.hh:512: error: ISO C++ forbids declaration of ‘Element’ with no type
> /Users/fallahi/svnwork/dune-trunk/dune-grid/dune/grid/uggrid/ugwrapper.hh:512: error: extra qualification ‘Dune::UG_NS<2>::’ on member ‘Element’
> /Users/fallahi/svnwork/dune-trunk/dune-grid/dune/grid/uggrid/ugwrapper.hh:512: error: expected ‘;’ before ‘*’ token
> /Users/fallahi/svnwork/dune-trunk/dune-grid/dune/grid/uggrid/ugwrapper.hh:517: error: expected `;' before ‘static’
> /Users/fallahi/svnwork/dune-trunk/dune-grid/dune/grid/uggrid/ugwrapper.hh:517: error: ISO C++ forbids declaration of ‘Node’ with no type
> /Users/fallahi/svnwork/dune-trunk/dune-grid/dune/grid/uggrid/ugwrapper.hh:517: error: extra qualification ‘Dune::UG_NS<2>::’ on member ‘Node’
> /Users/fallahi/svnwork/dune-trunk/dune-grid/dune/grid/uggrid/ugwrapper.hh:517: error: expected ‘;’ before ‘*’ token
> /Users/fallahi/svnwork/dune-trunk/dune-grid/dune/grid/uggrid/ugwrapper.hh:522: error: expected `;' before ‘static’
> /Users/fallahi/svnwork/dune-trunk/dune-grid/dune/grid/uggrid/ugwrapper.hh:540: error: expected unqualified-id before ‘*’ token
> /Users/fallahi/svnwork/dune-trunk/dune-grid/dune/grid/uggrid/ugwrapper.hh:540: error: expected ‘,’ or ‘...’ before ‘*’ token
> /Users/fallahi/svnwork/dune-trunk/dune-grid/dune/grid/uggrid/ugwrapper.hh:558: error: expected unqualified-id before ‘*’ token
> /Users/fallahi/svnwork/dune-trunk/dune-grid/dune/grid/uggrid/ugwrapper.hh:558: error: expected ‘,’ or ‘...’ before ‘*’ token
> /Users/fallahi/svnwork/dune-trunk/dune-grid/dune/grid/uggrid/ugwrapper.hh:558: error: ‘static bool Dune::UG_NS<2>::isLeaf()’ cannot be overloaded
> /Users/fallahi/svnwork/dune-trunk/dune-grid/dune/grid/uggrid/ugwrapper.hh:540: error: with ‘static bool Dune::UG_NS<2>::isLeaf()’
> /Users/fallahi/svnwork/dune-trunk/dune-grid/dune/grid/uggrid/ugwrapper.hh:586: error: expected ‘;’ before ‘(’ token
> /Users/fallahi/svnwork/dune-trunk/dune-grid/dune/grid/uggrid/ugwrapper.hh:591: error: expected `;' before ‘static’
> /Users/fallahi/svnwork/dune-trunk/dune-grid/dune/grid/uggrid/ugwrapper.hh:591: error: expected unqualified-id before ‘*’ token
> /Users/fallahi/svnwork/dune-trunk/dune-grid/dune/grid/uggrid/ugwrapper.hh:591: error: expected ‘,’ or ‘...’ before ‘*’ token
> /Users/fallahi/svnwork/dune-trunk/dune-grid/dune/grid/uggrid/ugwrapper.hh:596: error: expected ‘;’ before ‘(’ token
> othergrids.cc:55: error: expected `;' at end of input
> othergrids.cc:55: error: expected `}' at end of input
> /Users/fallahi/svnwork/dune-trunk/dune-grid/dune/grid/uggrid/ugwrapper.hh: In static member function ‘static void Dune::UG_NS<2>::Corner_Coordinates()’:
> /Users/fallahi/svnwork/dune-trunk/dune-grid/dune/grid/uggrid/ugwrapper.hh:319: error: ‘UG’ has not been declared
> /Users/fallahi/svnwork/dune-trunk/dune-grid/dune/grid/uggrid/ugwrapper.hh:320: error: ‘UG’ has not been declared
> /Users/fallahi/svnwork/dune-trunk/dune-grid/dune/grid/uggrid/ugwrapper.hh:321: error: ‘UG’ has not been declared
> /Users/fallahi/svnwork/dune-trunk/dune-grid/dune/grid/uggrid/ugwrapper.hh:322: error: ‘UG’ has not been declared
> /Users/fallahi/svnwork/dune-trunk/dune-grid/dune/grid/uggrid/ugwrapper.hh:323: error: ‘UG’ has not been declared
> /Users/fallahi/svnwork/dune-trunk/dune-grid/dune/grid/uggrid/ugwrapper.hh:324: error: ‘UG’ has not been declared
> /Users/fallahi/svnwork/dune-trunk/dune-grid/dune/grid/uggrid/ugwrapper.hh:325: error: ‘UG’ has not been declared
> /Users/fallahi/svnwork/dune-trunk/dune-grid/dune/grid/uggrid/ugwrapper.hh:326: error: ‘UG’ has not been declared
> /Users/fallahi/svnwork/dune-trunk/dune-grid/dune/grid/uggrid/ugwrapper.hh:328: error: ‘theElement’ was not declared in this scope
> /Users/fallahi/svnwork/dune-trunk/dune-grid/dune/grid/uggrid/ugwrapper.hh:328: error: ‘x’ was not declared in this scope
> /Users/fallahi/svnwork/dune-trunk/dune-grid/dune/grid/uggrid/ugwrapper.hh:328: error: ‘CORNER_COORDINATES’ was not declared in this scope
> /Users/fallahi/svnwork/dune-trunk/dune-grid/dune/grid/uggrid/ugwrapper.hh: In static member function ‘static void Dune::UG_NS<2>::Corner_Coordinates()’:
> /Users/fallahi/svnwork/dune-trunk/dune-grid/dune/grid/uggrid/ugwrapper.hh:333: error: ‘x’ was not declared in this scope
> /Users/fallahi/svnwork/dune-trunk/dune-grid/dune/grid/uggrid/ugwrapper.hh:333: error: ‘theNode’ was not declared in this scope
> /Users/fallahi/svnwork/dune-trunk/dune-grid/dune/grid/uggrid/ugwrapper.hh: In static member function ‘static int Dune::UG_NS<2>::GlobalToLocal(int, const double**, const double*, double*)’:
> /Users/fallahi/svnwork/dune-trunk/dune-grid/dune/grid/uggrid/ugwrapper.hh:338: error: ‘UG’ has not been declared
> /Users/fallahi/svnwork/dune-trunk/dune-grid/dune/grid/uggrid/ugwrapper.hh: In static member function ‘static double Dune::UG_NS<2>::Area_Of_Element(int, const double**)’:
> /Users/fallahi/svnwork/dune-trunk/dune-grid/dune/grid/uggrid/ugwrapper.hh:344: error: ‘UG’ has not been declared
> /Users/fallahi/svnwork/dune-trunk/dune-grid/dune/grid/uggrid/ugwrapper.hh:345: error: ‘UG’ has not been declared
> /Users/fallahi/svnwork/dune-trunk/dune-grid/dune/grid/uggrid/ugwrapper.hh:347: error: ‘AREA_OF_ELEMENT_2D’ was not declared in this scope
> /Users/fallahi/svnwork/dune-trunk/dune-grid/dune/grid/uggrid/ugwrapper.hh: In static member function ‘static int Dune::UG_NS<2>::myLevel()’:
> /Users/fallahi/svnwork/dune-trunk/dune-grid/dune/grid/uggrid/ugwrapper.hh:355: error: ‘UG’ has not been declared
> /Users/fallahi/svnwork/dune-trunk/dune-grid/dune/grid/uggrid/ugwrapper.hh:356: error: ‘theElement’ was not declared in this scope
> /Users/fallahi/svnwork/dune-trunk/dune-grid/dune/grid/uggrid/ugwrapper.hh:356: error: ‘LEVEL’ was not declared in this scope
> /Users/fallahi/svnwork/dune-trunk/dune-grid/dune/grid/uggrid/ugwrapper.hh: In static member function ‘static int Dune::UG_NS<2>::myLevel()’:
> /Users/fallahi/svnwork/dune-trunk/dune-grid/dune/grid/uggrid/ugwrapper.hh:360: error: ‘UG’ has not been declared
> /Users/fallahi/svnwork/dune-trunk/dune-grid/dune/grid/uggrid/ugwrapper.hh:361: error: ‘theNode’ was not declared in this scope
> /Users/fallahi/svnwork/dune-trunk/dune-grid/dune/grid/uggrid/ugwrapper.hh:361: error: ‘LEVEL’ was not declared in this scope
> /Users/fallahi/svnwork/dune-trunk/dune-grid/dune/grid/uggrid/ugwrapper.hh: In static member function ‘static bool Dune::UG_NS<2>::hasCopy()’:
> /Users/fallahi/svnwork/dune-trunk/dune-grid/dune/grid/uggrid/ugwrapper.hh:366: error: ‘UG’ has not been declared
> /Users/fallahi/svnwork/dune-trunk/dune-grid/dune/grid/uggrid/ugwrapper.hh:367: error: ‘UG’ has not been declared
> /Users/fallahi/svnwork/dune-trunk/dune-grid/dune/grid/uggrid/ugwrapper.hh:368: error: ‘UG’ has not been declared
> /Users/fallahi/svnwork/dune-trunk/dune-grid/dune/grid/uggrid/ugwrapper.hh:369: error: ‘UG’ has not been declared
> /Users/fallahi/svnwork/dune-trunk/dune-grid/dune/grid/uggrid/ugwrapper.hh:370: error: ‘UG’ has not been declared
> /Users/fallahi/svnwork/dune-trunk/dune-grid/dune/grid/uggrid/ugwrapper.hh:371: error: ‘theElement’ was not declared in this scope
> /Users/fallahi/svnwork/dune-trunk/dune-grid/dune/grid/uggrid/ugwrapper.hh:371: error: ‘REFINECLASS’ was not declared in this scope
> /Users/fallahi/svnwork/dune-trunk/dune-grid/dune/grid/uggrid/ugwrapper.hh:371: error: ‘YELLOW_CLASS’ was not declared in this scope
> /Users/fallahi/svnwork/dune-trunk/dune-grid/dune/grid/uggrid/ugwrapper.hh: In static member function ‘static bool Dune::UG_NS<2>::isRegular()’:
> /Users/fallahi/svnwork/dune-trunk/dune-grid/dune/grid/uggrid/ugwrapper.hh:376: error: ‘UG’ has not been declared
> /Users/fallahi/svnwork/dune-trunk/dune-grid/dune/grid/uggrid/ugwrapper.hh:377: error: ‘UG’ has not been declared
> /Users/fallahi/svnwork/dune-trunk/dune-grid/dune/grid/uggrid/ugwrapper.hh:378: error: ‘UG’ has not been declared
> /Users/fallahi/svnwork/dune-trunk/dune-grid/dune/grid/uggrid/ugwrapper.hh:379: error: ‘theElement’ was not declared in this scope
> /Users/fallahi/svnwork/dune-trunk/dune-grid/dune/grid/uggrid/ugwrapper.hh:379: error: ‘ECLASS’ was not declared in this scope
> /Users/fallahi/svnwork/dune-trunk/dune-grid/dune/grid/uggrid/ugwrapper.hh: In static member function ‘static int Dune::UG_NS<2>::Sides_Of_Elem()’:
> /Users/fallahi/svnwork/dune-trunk/dune-grid/dune/grid/uggrid/ugwrapper.hh:384: error: ‘UG’ has not been declared
> /Users/fallahi/svnwork/dune-trunk/dune-grid/dune/grid/uggrid/ugwrapper.hh:385: error: ‘UG’ has not been declared
> /Users/fallahi/svnwork/dune-trunk/dune-grid/dune/grid/uggrid/ugwrapper.hh:386: error: ‘theElement’ was not declared in this scope
> /Users/fallahi/svnwork/dune-trunk/dune-grid/dune/grid/uggrid/ugwrapper.hh:386: error: ‘SIDES_OF_ELEM’ was not declared in this scope
> /Users/fallahi/svnwork/dune-trunk/dune-grid/dune/grid/uggrid/ugwrapper.hh: In static member function ‘static int Dune::UG_NS<2>::boundarySegmentIndex()’:
> /Users/fallahi/svnwork/dune-trunk/dune-grid/dune/grid/uggrid/ugwrapper.hh:398: error: ‘UG’ has not been declared
> /Users/fallahi/svnwork/dune-trunk/dune-grid/dune/grid/uggrid/ugwrapper.hh:399: error: ‘UG’ has not been declared
> /Users/fallahi/svnwork/dune-trunk/dune-grid/dune/grid/uggrid/ugwrapper.hh:400: error: ‘UG’ has not been declared
> /Users/fallahi/svnwork/dune-trunk/dune-grid/dune/grid/uggrid/ugwrapper.hh:402: error: ‘BNDS’ was not declared in this scope
> /Users/fallahi/svnwork/dune-trunk/dune-grid/dune/grid/uggrid/ugwrapper.hh:402: error: ‘bnds’ was not declared in this scope
> /Users/fallahi/svnwork/dune-trunk/dune-grid/dune/grid/uggrid/ugwrapper.hh:402: error: ‘theElement’ was not declared in this scope
> /Users/fallahi/svnwork/dune-trunk/dune-grid/dune/grid/uggrid/ugwrapper.hh:402: error: ‘nb’ was not declared in this scope
> /Users/fallahi/svnwork/dune-trunk/dune-grid/dune/grid/uggrid/ugwrapper.hh:402: error: ‘ELEM_BNDS’ was not declared in this scope
> /Users/fallahi/svnwork/dune-trunk/dune-grid/dune/grid/uggrid/ugwrapper.hh:403: error: ‘UG’ has not been declared
> /Users/fallahi/svnwork/dune-trunk/dune-grid/dune/grid/uggrid/ugwrapper.hh: In static member function ‘static bool Dune::UG_NS<2>::Side_On_Bnd()’:
> /Users/fallahi/svnwork/dune-trunk/dune-grid/dune/grid/uggrid/ugwrapper.hh:409: error: ‘UG’ has not been declared
> /Users/fallahi/svnwork/dune-trunk/dune-grid/dune/grid/uggrid/ugwrapper.hh:410: error: ‘UG’ has not been declared
> /Users/fallahi/svnwork/dune-trunk/dune-grid/dune/grid/uggrid/ugwrapper.hh:411: error: ‘UG’ has not been declared
> /Users/fallahi/svnwork/dune-trunk/dune-grid/dune/grid/uggrid/ugwrapper.hh:412: error: ‘UG’ has not been declared
> /Users/fallahi/svnwork/dune-trunk/dune-grid/dune/grid/uggrid/ugwrapper.hh:413: error: ‘UG’ has not been declared
> /Users/fallahi/svnwork/dune-trunk/dune-grid/dune/grid/uggrid/ugwrapper.hh:414: error: ‘theElement’ was not declared in this scope
> /Users/fallahi/svnwork/dune-trunk/dune-grid/dune/grid/uggrid/ugwrapper.hh:414: error: ‘OBJT’ was not declared in this scope
> /Users/fallahi/svnwork/dune-trunk/dune-grid/dune/grid/uggrid/ugwrapper.hh:414: error: ‘BEOBJ’ was not declared in this scope
> /Users/fallahi/svnwork/dune-trunk/dune-grid/dune/grid/uggrid/ugwrapper.hh:414: error: ‘i’ was not declared in this scope
> /Users/fallahi/svnwork/dune-trunk/dune-grid/dune/grid/uggrid/ugwrapper.hh:414: error: ‘SIDE_ON_BND’ was not declared in this scope
> /Users/fallahi/svnwork/dune-trunk/dune-grid/dune/grid/uggrid/ugwrapper.hh: In static member function ‘static bool Dune::UG_NS<2>::isBoundaryElement()’:
> /Users/fallahi/svnwork/dune-trunk/dune-grid/dune/grid/uggrid/ugwrapper.hh:419: error: ‘UG’ has not been declared
> /Users/fallahi/svnwork/dune-trunk/dune-grid/dune/grid/uggrid/ugwrapper.hh:420: error: ‘UG’ has not been declared
> /Users/fallahi/svnwork/dune-trunk/dune-grid/dune/grid/uggrid/ugwrapper.hh:421: error: ‘UG’ has not been declared
> /Users/fallahi/svnwork/dune-trunk/dune-grid/dune/grid/uggrid/ugwrapper.hh:422: error: ‘theElement’ was not declared in this scope
> /Users/fallahi/svnwork/dune-trunk/dune-grid/dune/grid/uggrid/ugwrapper.hh:422: error: ‘OBJT’ was not declared in this scope
> /Users/fallahi/svnwork/dune-trunk/dune-grid/dune/grid/uggrid/ugwrapper.hh:422: error: ‘BEOBJ’ was not declared in this scope
> /Users/fallahi/svnwork/dune-trunk/dune-grid/dune/grid/uggrid/ugwrapper.hh: In static member function ‘static int Dune::UG_NS<2>::Edges_Of_Elem()’:
> /Users/fallahi/svnwork/dune-trunk/dune-grid/dune/grid/uggrid/ugwrapper.hh:427: error: ‘UG’ has not been declared
> /Users/fallahi/svnwork/dune-trunk/dune-grid/dune/grid/uggrid/ugwrapper.hh:428: error: ‘UG’ has not been declared
> /Users/fallahi/svnwork/dune-trunk/dune-grid/dune/grid/uggrid/ugwrapper.hh:429: error: ‘theElement’ was not declared in this scope
> /Users/fallahi/svnwork/dune-trunk/dune-grid/dune/grid/uggrid/ugwrapper.hh:429: error: ‘EDGES_OF_ELEM’ was not declared in this scope
> /Users/fallahi/svnwork/dune-trunk/dune-grid/dune/grid/uggrid/ugwrapper.hh: In static member function ‘static int Dune::UG_NS<2>::Corners_Of_Elem()’:
> /Users/fallahi/svnwork/dune-trunk/dune-grid/dune/grid/uggrid/ugwrapper.hh:434: error: ‘UG’ has not been declared
> /Users/fallahi/svnwork/dune-trunk/dune-grid/dune/grid/uggrid/ugwrapper.hh:435: error: ‘UG’ has not been declared
> /Users/fallahi/svnwork/dune-trunk/dune-grid/dune/grid/uggrid/ugwrapper.hh:436: error: ‘theElement’ was not declared in this scope
> /Users/fallahi/svnwork/dune-trunk/dune-grid/dune/grid/uggrid/ugwrapper.hh:436: error: ‘CORNERS_OF_ELEM’ was not declared in this scope
> /Users/fallahi/svnwork/dune-trunk/dune-grid/dune/grid/uggrid/ugwrapper.hh: In static member function ‘static int Dune::UG_NS<2>::Corners_Of_Side()’:
> /Users/fallahi/svnwork/dune-trunk/dune-grid/dune/grid/uggrid/ugwrapper.hh:447: error: ‘UG’ has not been declared
> /Users/fallahi/svnwork/dune-trunk/dune-grid/dune/grid/uggrid/ugwrapper.hh:448: error: ‘UG’ has not been declared
> /Users/fallahi/svnwork/dune-trunk/dune-grid/dune/grid/uggrid/ugwrapper.hh:449: error: ‘theElement’ was not declared in this scope
> /Users/fallahi/svnwork/dune-trunk/dune-grid/dune/grid/uggrid/ugwrapper.hh:449: error: ‘side’ was not declared in this scope
> /Users/fallahi/svnwork/dune-trunk/dune-grid/dune/grid/uggrid/ugwrapper.hh:449: error: ‘CORNERS_OF_SIDE’ was not declared in this scope
> /Users/fallahi/svnwork/dune-trunk/dune-grid/dune/grid/uggrid/ugwrapper.hh: In static member function ‘static int Dune::UG_NS<2>::Corner_Of_Side()’:
> /Users/fallahi/svnwork/dune-trunk/dune-grid/dune/grid/uggrid/ugwrapper.hh:454: error: ‘UG’ has not been declared
> /Users/fallahi/svnwork/dune-trunk/dune-grid/dune/grid/uggrid/ugwrapper.hh:455: error: ‘UG’ has not been declared
> /Users/fallahi/svnwork/dune-trunk/dune-grid/dune/grid/uggrid/ugwrapper.hh:456: error: ‘theElement’ was not declared in this scope
> /Users/fallahi/svnwork/dune-trunk/dune-grid/dune/grid/uggrid/ugwrapper.hh:456: error: ‘side’ was not declared in this scope
> /Users/fallahi/svnwork/dune-trunk/dune-grid/dune/grid/uggrid/ugwrapper.hh:456: error: ‘corner’ was not declared in this scope
> /Users/fallahi/svnwork/dune-trunk/dune-grid/dune/grid/uggrid/ugwrapper.hh:456: error: ‘CORNER_OF_SIDE’ was not declared in this scope
> /Users/fallahi/svnwork/dune-trunk/dune-grid/dune/grid/uggrid/ugwrapper.hh: In static member function ‘static int Dune::UG_NS<2>::Corner_Of_Edge()’:
> /Users/fallahi/svnwork/dune-trunk/dune-grid/dune/grid/uggrid/ugwrapper.hh:461: error: ‘UG’ has not been declared
> /Users/fallahi/svnwork/dune-trunk/dune-grid/dune/grid/uggrid/ugwrapper.hh:462: error: ‘UG’ has not been declared
> /Users/fallahi/svnwork/dune-trunk/dune-grid/dune/grid/uggrid/ugwrapper.hh:463: error: ‘theElement’ was not declared in this scope
> /Users/fallahi/svnwork/dune-trunk/dune-grid/dune/grid/uggrid/ugwrapper.hh:463: error: ‘edge’ was not declared in this scope
> /Users/fallahi/svnwork/dune-trunk/dune-grid/dune/grid/uggrid/ugwrapper.hh:463: error: ‘corner’ was not declared in this scope
> /Users/fallahi/svnwork/dune-trunk/dune-grid/dune/grid/uggrid/ugwrapper.hh:463: error: ‘CORNER_OF_EDGE’ was not declared in this scope
> /Users/fallahi/svnwork/dune-trunk/dune-grid/dune/grid/uggrid/ugwrapper.hh: In static member function ‘static int Dune::UG_NS<2>::nSons(int)’:
> /Users/fallahi/svnwork/dune-trunk/dune-grid/dune/grid/uggrid/ugwrapper.hh:468: error: ‘UG’ is not a class or namespace
> /Users/fallahi/svnwork/dune-trunk/dune-grid/dune/grid/uggrid/ugwrapper.hh:468: error: ‘element’ was not declared in this scope
> /Users/fallahi/svnwork/dune-trunk/dune-grid/dune/grid/uggrid/ugwrapper.hh:468: error: ‘UG’ is not a class or namespace
> /Users/fallahi/svnwork/dune-trunk/dune-grid/dune/grid/uggrid/ugwrapper.hh: In static member function ‘static int Dune::UG_NS<2>::GetSons(int)’:
> /Users/fallahi/svnwork/dune-trunk/dune-grid/dune/grid/uggrid/ugwrapper.hh:472: error: ‘UG’ is not a class or namespace
> /Users/fallahi/svnwork/dune-trunk/dune-grid/dune/grid/uggrid/ugwrapper.hh:472: error: ‘element’ was not declared in this scope
> /Users/fallahi/svnwork/dune-trunk/dune-grid/dune/grid/uggrid/ugwrapper.hh:472: error: ‘sonList’ was not declared in this scope
> /Users/fallahi/svnwork/dune-trunk/dune-grid/dune/grid/uggrid/ugwrapper.hh: In static member function ‘static int Dune::UG_NS<2>::GetNodeContext(int)’:
> /Users/fallahi/svnwork/dune-trunk/dune-grid/dune/grid/uggrid/ugwrapper.hh:477: error: ‘UG’ is not a class or namespace
> /Users/fallahi/svnwork/dune-trunk/dune-grid/dune/grid/uggrid/ugwrapper.hh:477: error: ‘element’ was not declared in this scope
> /Users/fallahi/svnwork/dune-trunk/dune-grid/dune/grid/uggrid/ugwrapper.hh:477: error: expected type-specifier before ‘UG’
> /Users/fallahi/svnwork/dune-trunk/dune-grid/dune/grid/uggrid/ugwrapper.hh:477: error: expected `>' before ‘UG’
> /Users/fallahi/svnwork/dune-trunk/dune-grid/dune/grid/uggrid/ugwrapper.hh:477: error: expected `(' before ‘UG’
> /Users/fallahi/svnwork/dune-trunk/dune-grid/dune/grid/uggrid/ugwrapper.hh:477: error: ‘UG’ is not a class or namespace
> /Users/fallahi/svnwork/dune-trunk/dune-grid/dune/grid/uggrid/ugwrapper.hh:477: error: expected primary-expression before ‘>’ token
> /Users/fallahi/svnwork/dune-trunk/dune-grid/dune/grid/uggrid/ugwrapper.hh:477: error: ‘context’ was not declared in this scope
> /Users/fallahi/svnwork/dune-trunk/dune-grid/dune/grid/uggrid/ugwrapper.hh: In static member function ‘static int Dune::UG_NS<2>::Grid_Attr()’:
> /Users/fallahi/svnwork/dune-trunk/dune-grid/dune/grid/uggrid/ugwrapper.hh:482: error: ‘grid’ was not declared in this scope
> /Users/fallahi/svnwork/dune-trunk/dune-grid/dune/grid/uggrid/ugwrapper.hh:482: error: ‘GRID_ATTR’ was not declared in this scope
> /Users/fallahi/svnwork/dune-trunk/dune-grid/dune/grid/uggrid/ugwrapper.hh: In static member function ‘static int Dune::UG_NS<2>::MarkForRefinement(int)’:
> /Users/fallahi/svnwork/dune-trunk/dune-grid/dune/grid/uggrid/ugwrapper.hh:486: error: ‘UG’ has not been declared
> /Users/fallahi/svnwork/dune-trunk/dune-grid/dune/grid/uggrid/ugwrapper.hh:486: error: ‘UG’ has not been declared
> /Users/fallahi/svnwork/dune-trunk/dune-grid/dune/grid/uggrid/ugwrapper.hh:486: error: ‘data’ was not declared in this scope
> /Users/fallahi/svnwork/dune-trunk/dune-grid/dune/grid/uggrid/ugwrapper.hh: In static member function ‘static unsigned int Dune::UG_NS<2>::Tag()’:
> /Users/fallahi/svnwork/dune-trunk/dune-grid/dune/grid/uggrid/ugwrapper.hh:491: error: ‘UG’ has not been declared
> /Users/fallahi/svnwork/dune-trunk/dune-grid/dune/grid/uggrid/ugwrapper.hh:492: error: ‘theElement’ was not declared in this scope
> /Users/fallahi/svnwork/dune-trunk/dune-grid/dune/grid/uggrid/ugwrapper.hh:492: error: ‘TAG’ was not declared in this scope
> /Users/fallahi/svnwork/dune-trunk/dune-grid/dune/grid/uggrid/ugwrapper.hh: In static member function ‘static void Dune::UG_NS<2>::getCornerLocal()’:
> /Users/fallahi/svnwork/dune-trunk/dune-grid/dune/grid/uggrid/ugwrapper.hh:505: error: ‘UG’ has not been declared
> /Users/fallahi/svnwork/dune-trunk/dune-grid/dune/grid/uggrid/ugwrapper.hh:506: error: ‘UG’ has not been declared
> /Users/fallahi/svnwork/dune-trunk/dune-grid/dune/grid/uggrid/ugwrapper.hh:508: error: ‘local’ was not declared in this scope
> /Users/fallahi/svnwork/dune-trunk/dune-grid/dune/grid/uggrid/ugwrapper.hh:508: error: ‘theElement’ was not declared in this scope
> /Users/fallahi/svnwork/dune-trunk/dune-grid/dune/grid/uggrid/ugwrapper.hh:508: error: there are no arguments to ‘TAG’ that depend on a template parameter, so a declaration of ‘TAG’ must be available
> /Users/fallahi/svnwork/dune-trunk/dune-grid/dune/grid/uggrid/ugwrapper.hh:508: error: (if you use ‘-fpermissive’, G++ will accept your code, but allowing the use of an undeclared name is deprecated)
> /Users/fallahi/svnwork/dune-trunk/dune-grid/dune/grid/uggrid/ugwrapper.hh:508: error: ‘corner’ was not declared in this scope
> /Users/fallahi/svnwork/dune-trunk/dune-grid/dune/grid/uggrid/ugwrapper.hh: In static member function ‘static bool Dune::UG_NS<2>::isLeaf()’:
> /Users/fallahi/svnwork/dune-trunk/dune-grid/dune/grid/uggrid/ugwrapper.hh:554: error: ‘UG’ has not been declared
> /Users/fallahi/svnwork/dune-trunk/dune-grid/dune/grid/uggrid/ugwrapper.hh:554: error: ‘theElement’ was not declared in this scope
> /Users/fallahi/svnwork/dune-trunk/dune-grid/dune/grid/uggrid/ugwrapper.hh: In static member function ‘static bool Dune::UG_NS<2>::isLeaf()’:
> /Users/fallahi/svnwork/dune-trunk/dune-grid/dune/grid/uggrid/ugwrapper.hh:578: error: ‘theNode’ was not declared in this scope
> /Users/fallahi/svnwork/dune-trunk/dune-grid/dune/grid/uggrid/ugwrapper.hh: In static member function ‘static const int&  Dune::UG_NS<2>::levelIndex()’:
> /Users/fallahi/svnwork/dune-trunk/dune-grid/dune/grid/uggrid/ugwrapper.hh:592: error: ‘theElement’ was not declared in this scope
> /Users/fallahi/svnwork/dune-trunk/dune-grid/dune/grid/uggrid/ugwrapper.hh: At global scope:
> /Users/fallahi/svnwork/dune-trunk/dune-grid/dune/grid/uggrid/ugwrapper.hh:593: error: expected unqualified-id at end of input
> /Users/fallahi/svnwork/dune-trunk/dune-grid/dune/grid/uggrid/ugwrapper.hh:593: error: expected `}' at end of input
> /Users/fallahi/svnwork/dune-trunk/dune-grid/dune/grid/utility/structuredgridfactory.hh: In constructor ‘Dune::StructuredGridFactory<GridType>::MultiIndex::MultiIndex(const Dune::array<unsigned int, Dune::StructuredGridFactory<GridType>::dim>&) [with GridType = Dune::ALUCubeGrid<3, 3>]’:
> /Users/fallahi/svnwork/dune-trunk/dune-grid/dune/grid/utility/structuredgridfactory.hh:149:   instantiated from ‘static std::tr1::shared_ptr<_Tp>  Dune::StructuredGridFactory<GridType>::createCubeGrid(const Dune::FieldVector<typename GridType::ctype, Dune::StructuredGridFactory<GridType>::dimworld>&, const Dune::FieldVector<typename GridType::ctype, Dune::StructuredGridFactory<GridType>::dimworld>&, const Dune::array<unsigned int, Dune::StructuredGridFactory<GridType>::dim>&) [with GridType = Dune::ALUCubeGrid<3, 3>]’
> unitcube_alugrid.hh:55:   instantiated from here
> /Users/fallahi/svnwork/dune-trunk/dune-grid/dune/grid/utility/structuredgridfactory.hh:40: error: ‘class Dune::StructuredGridFactory<Dune::ALUCubeGrid<3, 3>  >::MultiIndex’ has no member named ‘fill’
> make[2]: *** [othergrids-othergrids.o] Error 1
> make[1]: *** [all-recursive] Error 1
> make: *** [all] Error 2
>
>
> _______________________________________________
> Dune mailing list
> Dune at dune-project.org
> http://lists.dune-project.org/mailman/listinfo/dune
>    


-- 
************************************************************************
* Oliver Sander                ** email: sander at mi.fu-berlin.de        *
* Freie Universität Berlin     ** phone: + 49 (30) 838 75348           *
* Institut für Mathematik      ** URL  : page.mi.fu-berlin.de/~sander  *
* Arnimallee 6                 ** -------------------------------------*
* 14195 Berlin, Germany        ** Member of MATHEON (www.matheon.de)   *
************************************************************************




More information about the Dune mailing list